{"text_format":"3","workbook":"xlsx","n_sheets":5,"sheets":["Ruta","Resumen","Promociones","Hoja1","Encuesta"],"not_rendered":{"defined_names":4,"comments":2,"pivot_tables":1},"read":"whole","date_system":"1900"}

{"sheet":"Ruta","index":0,"n_rows":184,"n_cols":27,"rows_kept":184,"merged":[[1,1,1,26]]}
[]
[null,"Aliados Red de la Alegría"]
[null,"Activo","#","Ciudad","Canal ","Responsable","Cliente","Línea Domicilio","Promoción","Dirección","Nit","Uds Sem 1","Uds Sem 2","Uds Sem 3","Uds Sem 4","Uds Sem 5","Uds Sem 6","Uds Sem 7","Uds Sem 8","Uds Sem 9","Uds Sem 10","Uds Sem 11","Uds Sem 12","Uds Sem 13","Uds Sem 14","Uds Sem 15","Observación"]
[null,"SI",1,"La Unión ","Supermercado","Jhenny Romero","Supermercado MercaPlaza",2023491,"Marques 3años Botella + Can Agte ","Calle 14 # 15 - 13",null,null,8,6,8,7,6,6,8,12,4,3,2,4,3]
[null,"SI",{"$f":"+C4+1","v":2},"Rozo","Licorera","Katherine Rengifo","Estanco Blanco del Valle",3122475697,"Marques 3años Botella + Can Agte ","Calle 10 # 9A- 29",null,{"$f":"4*12","v":48},48,60,180,360,480,360,480,600,360,480,420,144,360]
[null,"SI",{"$f":"+C5+1","v":3},"Guacarí","Mayorista ","Katherine Rengifo","Licores Los Paisas",3216537169,"Marques 3años Botella + Can Agte ","Carrera 7 # 4 - 80",null,0,36,120,360,360,540,600,720,900,600,600,480,252,336]
[null,"NO",4,"Valle ","Supermercado","Miriam Mejia","SurtiFamiliar",4873041,"Marques 3años Botella + Can Agte  - Marques 3años Botella  + Can Marques 3años -Marques Bot 3años P2 x 3 - Marques Can P2 X3 -",{"$nulls":3},90]
[null,"NO",5,"Cali ","Supermercado","Miriam Mejia","Supermercados Galerías Plaza",3041365780,null,"Cl. 19 Oe. #4 A 11",null,null,70]
[null,"NO",6,"Valle ","Supermercado","Miriam Mejia","Confandi",3176365583,"Marques 3años Botella + Can Agte  - Marques 3años Botella  + Can Marques 3años -Marques Bot 3años P2 x 3 - Marques Can P2 X3 -",{"$nulls":3},113]
[null,"SI",7,"Cali","Mayorista ","Edwin Polanco","Los Paisas de la 44","4415918 - 3113078334","Marques 3años Botella + Can Agte  - Marques 3años Botella  + Can Marques 3años","calle 44 # 14-62",null,360,420,396,600,540,480,720,660,600,780,2280,420,480,600]
{"$rows_left_out":175}
{"sheet":"Resumen","index":1,"n_rows":25,"n_cols":22,"rows_kept":25,"merged":[[2,1,2,21]]}
[]
[null,"Volumen en unidades de 750cc"]
[null,"Red Aliados de la Alegría"]
[null,"Equipo ","Responsable","Celuar","Zona","Canal ","# Aliados","Vol Sem 1","Vol Sem 2","Vol Sem 3","Vol Sem 4","Vol Sem 5","Vol Sem 6","Vol Sem 7","Vol Sem 8","Vol Sem 9","Vol Sem 10","Vol Sem 11","Vol Sem 12","Vol Sem 13","Vol Sem 14","Vol Sem 15"]
[null,"Lider Cadenas ","Ana Rosa Lopera",3223929958,"Valle ","Supermercado",4,null,{"$f":"+Ruta!M7+Ruta!M8+Ruta!M9","v":273},{"$f":"+Ruta!N7+Ruta!N8+Ruta!N9","v":0},{"$f":"+Ruta!O7+Ruta!O8+Ruta!O9","v":0},{"$f":"+Ruta!P7+Ruta!P8+Ruta!P9","v":0},{"$f":"+Ruta!Q7+Ruta!Q8+Ruta!Q9","v":0},{"$f":"+Ruta!R7+Ruta!R8+Ruta!R9","v":0},{"$f":"+Ruta!S7+Ruta!S8+Ruta!S9","v":0},{"$f":"+Ruta!T7+Ruta!T8+Ruta!T9","v":0},{"$f":"+Ruta!U7+Ruta!U8+Ruta!U9","v":0},{"$f":"+Ruta!V7+Ruta!V8+Ruta!V9","v":0},{"$f":"+Ruta!W7+Ruta!W8+Ruta!W9","v":0},{"$f":"+Ruta!X7+Ruta!X8+Ruta!X9","v":0},{"$f":"+Ruta!Y7+Ruta!Y8+Ruta!Y9","v":0},{"$f":"+Ruta!AA7+Ruta!AA8+Ruta!AA9","v":0}]
[null,"Lider Mayorista","Edwin Polanco",3234918326,"Cali","Mayoristas",13,{"v":2916,"d":"2,916"},{"$f":"+Ruta!M10+Ruta!M11+Ruta!M12+Ruta!M13+Ruta!M14+Ruta!M15+Ruta!M16+Ruta!M17+Ruta!M18+Ruta!M19+Ruta!M20","v":{"v":5292,"d":"5,292"}},{"$f":"+Ruta!N10+Ruta!N11+Ruta!N12+Ruta!N13+Ruta!N14+Ruta!N15+Ruta!N16+Ruta!N17+Ruta!N18+Ruta!N19+Ruta!N20","v":{"v":5448,"d":"5,448"}},{"$f":"+Ruta!O10+Ruta!O11+Ruta!O12+Ruta!O13+Ruta!O14+Ruta!O15+Ruta!O16+Ruta!O17+Ruta!O18+Ruta!O19+Ruta!O20","v":{"v":12900,"d":"12,900"}},{"$f":"+Ruta!P10+Ruta!P11+Ruta!P12+Ruta!P13+Ruta!P14+Ruta!P15+Ruta!P16+Ruta!P17+Ruta!P18+Ruta!P19+Ruta!P20","v":{"v":12060,"d":"12,060"}},{"$f":"+Ruta!Q10+Ruta!Q11+Ruta!Q12+Ruta!Q13+Ruta!Q14+Ruta!Q15+Ruta!Q16+Ruta!Q17+Ruta!Q18+Ruta!Q19+Ruta!Q20","v":{"v":11184,"d":"11,184"}},{"$f":"+Ruta!R10+Ruta!R11+Ruta!R12+Ruta!R13+Ruta!R14+Ruta!R15+Ruta!R16+Ruta!R17+Ruta!R18+Ruta!R19+Ruta!R20","v":{"v":12420,"d":"12,420"}},{"$f":"+Ruta!S10+Ruta!S11+Ruta!S12+Ruta!S13+Ruta!S14+Ruta!S15+Ruta!S16+Ruta!S17+Ruta!S18+Ruta!S19+Ruta!S20","v":{"v":12264,"d":"12,264"}},{"$f":"+Ruta!T10+Ruta!T11+Ruta!T12+Ruta!T13+Ruta!T14+Ruta!T15+Ruta!T16+Ruta!T17+Ruta!T18+Ruta!T19+Ruta!T20","v":{"v":11904,"d":"11,904"}},{"$f":"+Ruta!U10+Ruta!U11+Ruta!U12+Ruta!U13+Ruta!U14+Ruta!U15+Ruta!U16+Ruta!U17+Ruta!U18+Ruta!U19+Ruta!U20","v":{"v":15900,"d":"15,900"}},{"$f":"+Ruta!V10+Ruta!V11+Ruta!V12+Ruta!V13+Ruta!V14+Ruta!V15+Ruta!V16+Ruta!V17+Ruta!V18+Ruta!V19+Ruta!V20","v":{"v":14820,"d":"14,820"}},{"$f":"+Ruta!W10+Ruta!W11+Ruta!W12+Ruta!W13+Ruta!W14+Ruta!W15+Ruta!W16+Ruta!W17+Ruta!W18+Ruta!W19+Ruta!W20","v":{"v":6312,"d":"6,312"}},{"$f":"+Ruta!X10+Ruta!X11+Ruta!X12+Ruta!X13+Ruta!X14+Ruta!X15+Ruta!X16+Ruta!X17+Ruta!X18+Ruta!X19+Ruta!X20","v":{"v":11964,"d":"11,964"}},{"$f":"+Ruta!Y10+Ruta!Y11+Ruta!Y12+Ruta!Y13+Ruta!Y14+Ruta!Y15+Ruta!Y16+Ruta!Y17+Ruta!Y18+Ruta!Y19+Ruta!Y20","v":{"v":15180,"d":"15,180"}},{"$f":"+Ruta!AA10+Ruta!AA11+Ruta!AA12+Ruta!AA13+Ruta!AA14+Ruta!AA15+Ruta!AA16+Ruta!AA17+Ruta!AA18+Ruta!AA19+Ruta!AA20","v":0}]
[null,"Lider Zona","Henry Arbelaez",3152536672,"BuenaVentura","Mayoristas ",2,204,{"$f":"+Ruta!M21+Ruta!M22","v":720},{"$f":"+Ruta!N21+Ruta!N22","v":912},{"$f":"+Ruta!O21+Ruta!O22","v":{"v":2724,"d":"2,724"}},{"$f":"+Ruta!P21+Ruta!P22","v":{"v":3000,"d":"3,000"}},{"$f":"+Ruta!Q21+Ruta!Q22","v":{"v":2580,"d":"2,580"}},{"$f":"+Ruta!R21+Ruta!R22","v":{"v":2568,"d":"2,568"}},{"$f":"+Ruta!S21+Ruta!S22","v":{"v":4380,"d":"4,380"}},{"$f":"+Ruta!T21+Ruta!T22","v":{"v":3240,"d":"3,240"}},{"$f":"+Ruta!U21+Ruta!U22","v":{"v":3660,"d":"3,660"}},{"$f":"+Ruta!V21+Ruta!V22","v":{"v":2880,"d":"2,880"}},{"$f":"+Ruta!W21+Ruta!W22","v":804},{"$f":"+Ruta!X21+Ruta!X22","v":{"v":2580,"d":"2,580"}},{"$f":"+Ruta!Y21+Ruta!Y22","v":{"v":2580,"d":"2,580"}},{"$f":"+Ruta!AA21+Ruta!AA22","v":0}]
[null,"Líder Zona","Jhenny Romero",3147936241,"Norte","Licorera",2,46,{"$f":"+Ruta!M117+Ruta!M120","v":58},{"$f":"+Ruta!N117+Ruta!N120","v":65},{"$f":"+Ruta!O117+Ruta!O120","v":46},{"$f":"+Ruta!P117+Ruta!P120","v":60},{"$f":"+Ruta!Q117+Ruta!Q120","v":80},{"$f":"+Ruta!R117+Ruta!R120","v":73},{"$f":"+Ruta!S117+Ruta!S120","v":92},{"$f":"+Ruta!T117+Ruta!T120","v":145},{"$f":"+Ruta!U117+Ruta!U120","v":100},{"$f":"+Ruta!V117+Ruta!V120","v":96},{"$f":"+Ruta!W117+Ruta!W120","v":90},{"$f":"+Ruta!X117+Ruta!X120","v":80},{"$f":"+Ruta!Y117+Ruta!Y120","v":80},{"$f":"+Ruta!AA117+Ruta!AA120","v":0}]
[null,"Líder Zona","Jhenny Romero",3147936241,"Norte","Mayorista",8,410,{"$f":"+Ruta!M114+Ruta!M115+Ruta!M116+Ruta!M118+Ruta!M119+Ruta!M121","v":423},{"$f":"+Ruta!N114+Ruta!N115+Ruta!N116+Ruta!N118+Ruta!N119+Ruta!N121","v":506},{"$f":"+Ruta!O114+Ruta!O115+Ruta!O116+Ruta!O118+Ruta!O119+Ruta!O121","v":489},{"$f":"+Ruta!P114+Ruta!P115+Ruta!P116+Ruta!P118+Ruta!P119+Ruta!P121","v":642},{"$f":"+Ruta!Q114+Ruta!Q115+Ruta!Q116+Ruta!Q118+Ruta!Q119+Ruta!Q121","v":815},{"$f":"+Ruta!R114+Ruta!R115+Ruta!R116+Ruta!R118+Ruta!R119+Ruta!R121","v":635},{"$f":"+Ruta!S114+Ruta!S115+Ruta!S116+Ruta!S118+Ruta!S119+Ruta!S121","v":{"v":1042,"d":"1,042"}},{"$f":"+Ruta!T114+Ruta!T115+Ruta!T116+Ruta!T118+Ruta!T119+Ruta!T121+Ruta!T167+Ruta!T168","v":{"v":1556,"d":"1,556"}},{"$f":"+Ruta!U114+Ruta!U115+Ruta!U116+Ruta!U118+Ruta!U119+Ruta!U121+Ruta!U167+Ruta!U168","v":{"v":1090,"d":"1,090"}},{"$f":"+Ruta!V114+Ruta!V115+Ruta!V116+Ruta!V118+Ruta!V119+Ruta!V121+Ruta!V167+Ruta!V168","v":{"v":1055,"d":"1,055"}},{"$f":"+Ruta!W114+Ruta!W115+Ruta!W116+Ruta!W118+Ruta!W119+Ruta!W121+Ruta!W167+Ruta!W168","v":{"v":1158,"d":"1,158"}},{"$f":"+Ruta!X114+Ruta!X115+Ruta!X116+Ruta!X118+Ruta!X119+Ruta!X121+Ruta!X167+Ruta!X168","v":{"v":1041,"d":"1,041"}},{"$f":"+Ruta!Y114+Ruta!Y115+Ruta!Y116+Ruta!Y118+Ruta!Y119+Ruta!Y121+Ruta!Y167+Ruta!Y168","v":{"v":1029,"d":"1,029"}},{"$f":"+Ruta!AA114+Ruta!AA115+Ruta!AA116+Ruta!AA118+Ruta!AA119+Ruta!AA121+Ruta!AA167+Ruta!AA168","v":0}]
[null,"Líder Zona","Jhenny Romero",3147936241,"Norte","Supermercado",1,null,{"$f":"+Ruta!M4","v":8},{"$f":"+Ruta!N4","v":6},{"$f":"+Ruta!O4","v":8},{"$f":"+Ruta!P4","v":7},{"$f":"+Ruta!Q4","v":6},{"$f":"+Ruta!R4","v":6},{"$f":"+Ruta!S4","v":8},{"$f":"+Ruta!T4","v":12},{"$f":"+Ruta!U4","v":4},{"$f":"+Ruta!V4","v":3},{"$f":"+Ruta!W4","v":2},{"$f":"+Ruta!X4","v":4},{"$f":"+Ruta!Y4","v":3},{"$f":"+Ruta!AA4","v":0}]
{"$rows_left_out":16}
{"sheet":"Promociones","index":2,"n_rows":173,"n_cols":23,"rows_kept":173,"merged":[[1,1,1,12]]}
[{"$nulls":14},"Unidades","Unidades","Unidades","Unidades","Unidades","Unidades","Unidades","Unidades"]
[null,"Aliados Red de la Alegría",{"$nulls":11},"Participacion","Parques","Parques","Escalera","Pirinola","Pirinola","Shots","Shot","Vasos RMV 8 años"]
[null,"Activo","#","Ciudad","Canal ","Responsable","Cliente","Línea Domicilio","Promoción","Dirección","Nit","Uds Sem 1","Uds Sem 7","Partiipación ",1000,"Asignación ",{"$f":"+P3","v":"Asignación "},3000,"Asignación",10000,"Asignación","Asignación"]
[null,{"$f":"+Ruta!B4","v":"SI"},{"$f":"+Ruta!C4","v":1},{"$f":"+Ruta!D4","v":"La Unión "},{"$f":"+Ruta!E4","v":"Supermercado"},{"$f":"+Ruta!F4","v":"Jhenny Romero"},{"$f":"+Ruta!G4","v":"Supermercado MercaPlaza"},{"$f":"+Ruta!H4","v":2023491},{"$f":"+Ruta!I4","v":"Marques 3años Botella + Can Agte "},{"$f":"+Ruta!J4","v":"Calle 14 # 15 - 13"},{"$f":"+Ruta!K4","v":0},null,{"$f":"+Ruta!R4","v":6},{"v":1.994614540740002E-4,"d":"0.02%"},{"$f":"+O$3*N4","v":{"v":0.1994614540740002,"d":"0"}},3,3,{"$f":"+R$3*N4","v":{"v":0.5983843622220005,"d":"1"}},{"$f":"+P4*3","v":9},{"$f":"+T$3*N4","v":{"v":1.994614540740002,"d":"2"}},{"$f":"+Q4*10","v":30},{"$f":"+S4","v":9}]
[null,{"$f":"+Ruta!B5","v":"SI"},{"$f":"+Ruta!C5","v":2},{"$f":"+Ruta!D5","v":"Rozo"},{"$f":"+Ruta!E5","v":"Licorera"},{"$f":"+Ruta!F5","v":"Katherine Rengifo"},{"$f":"+Ruta!G5","v":"Estanco Blanco del Valle"},{"$f":"+Ruta!H5","v":3122475697},{"$f":"+Ruta!I5","v":"Marques 3años Botella + Can Agte "},{"$f":"+Ruta!J5","v":"Calle 10 # 9A- 29"},{"$f":"+Ruta!K5","v":0},{"$f":"4*12","v":48},{"$f":"+Ruta!R5","v":360},{"v":0.011967687244440013,"d":"1.20%"},{"$f":"+O$3*N5","v":{"v":11.967687244440013,"d":"12"}},10,10,{"$f":"+R$3*N5","v":{"v":35.90306173332004,"d":"36"}},{"$f":"+P5*3","v":30},{"$f":"+T$3*N5","v":{"v":119.67687244440013,"d":"120"}},{"$f":"+Q5*10","v":100},{"$f":"+S5","v":30}]
[null,{"$f":"+Ruta!B6","v":"SI"},{"$f":"+Ruta!C6","v":3},{"$f":"+Ruta!D6","v":"Guacarí"},{"$f":"+Ruta!E6","v":"Mayorista "},{"$f":"+Ruta!F6","v":"Katherine Rengifo"},{"$f":"+Ruta!G6","v":"Licores Los Paisas"},{"$f":"+Ruta!H6","v":3216537169},{"$f":"+Ruta!I6","v":"Marques 3años Botella + Can Agte "},{"$f":"+Ruta!J6","v":"Carrera 7 # 4 - 80"},{"$f":"+Ruta!K6","v":0},0,{"$f":"+Ruta!R6","v":600},{"v":0.01994614540740002,"d":"1.99%"},{"v":19.946145407400017,"d":"20"},10,10,{"v":59.83843622220005,"d":"60"},60,{"v":199.4614540740002,"d":"199"},180,60]
[null,{"$f":"+Ruta!B7","v":"NO"},{"$f":"+Ruta!C7","v":4},{"$f":"+Ruta!D7","v":"Valle "},{"$f":"+Ruta!E7","v":"Supermercado"},{"$f":"+Ruta!F7","v":"Miriam Mejia"},{"$f":"+Ruta!G7","v":"SurtiFamiliar"},{"$f":"+Ruta!H7","v":4873041},{"$f":"+Ruta!I7","v":"Marques 3años Botella + Can Agte  - Marques 3años Botella  + Can Marques 3años -Marques Bot 3años P2 x 3 - Marques Can P2 X3 -"},{"$f":"+Ruta!J7","v":0},{"$f":"+Ruta!K7","v":0},null,{"$f":"+Ruta!R7","v":0},{"v":0,"d":"0.00%"},0,null,0,0,0,0,{"$f":"+Q7*10","v":0},0]
[null,{"$f":"+Ruta!B8","v":"NO"},{"$f":"+Ruta!C8","v":5},{"$f":"+Ruta!D8","v":"Cali "},{"$f":"+Ruta!E8","v":"Supermercado"},{"$f":"+Ruta!F8","v":"Miriam Mejia"},{"$f":"+Ruta!G8","v":"Supermercados Galerías Plaza"},{"$f":"+Ruta!H8","v":3041365780},{"$f":"+Ruta!I8","v":0},{"$f":"+Ruta!J8","v":"Cl. 19 Oe. #4 A 11"},{"$f":"+Ruta!K8","v":0},null,{"$f":"+Ruta!R8","v":0},{"v":0,"d":"0.00%"},0,null,0,0,0,0,0,0]
[null,{"$f":"+Ruta!B9","v":"NO"},{"$f":"+Ruta!C9","v":6},{"$f":"+Ruta!D9","v":"Valle "},{"$f":"+Ruta!E9","v":"Supermercado"},{"$f":"+Ruta!F9","v":"Miriam Mejia"},{"$f":"+Ruta!G9","v":"Confandi"},{"$f":"+Ruta!H9","v":3176365583},{"$f":"+Ruta!I9","v":"Marques 3años Botella + Can Agte  - Marques 3años Botella  + Can Marques 3años -Marques Bot 3años P2 x 3 - Marques Can P2 X3 -"},{"$f":"+Ruta!J9","v":0},{"$f":"+Ruta!K9","v":0},null,{"$f":"+Ruta!R9","v":0},{"v":0,"d":"0.00%"},0,null,0,0,0,0,0,0]
[null,{"$f":"+Ruta!B10","v":"SI"},{"$f":"+Ruta!C10","v":7},{"$f":"+Ruta!D10","v":"Cali"},{"$f":"+Ruta!E10","v":"Mayorista "},{"$f":"+Ruta!F10","v":"Edwin Polanco"},{"$f":"+Ruta!G10","v":"Los Paisas de la 44"},{"$f":"+Ruta!H10","v":"4415918 - 3113078334"},{"$f":"+Ruta!I10","v":"Marques 3años Botella + Can Agte  - Marques 3años Botella  + Can Marques 3años"},{"$f":"+Ruta!J10","v":"calle 44 # 14-62"},{"$f":"+Ruta!K10","v":0},360,{"$f":"+Ruta!R10","v":720},{"v":0.023935374488880026,"d":"2.39%"},{"v":23.935374488880026,"d":"24"},20,20,{"v":71.80612346664007,"d":"72"},65,{"v":239.35374488880026,"d":"239"},200,65]
{"$rows_left_out":164}
{"sheet":"Hoja1","index":3,"n_rows":89,"n_cols":11,"rows_kept":89,"hidden":true}
[]
[]
["Suma de Total","Etiquetas de columna"]
["Etiquetas de fila",1,2,3,"(en blanco)","Total general","ok",null,null,"Etiquetas de fila","ok"]
[2685975,null,null,10,null,10,{"$f":"+VLOOKUP(A5,Ruta!$K$38:$K$98,1,0)","v":{"$error":"#N/A"}},null,null,2685975,{"$error":"#N/A"}]
[3494086,2,{"$nulls":3},2,{"$f":"+VLOOKUP(A6,Ruta!$K$38:$K$98,1,0)","v":{"$error":"#N/A"}},null,null,3494086,{"$error":"#N/A"}]
[4453658,null,2,null,null,2,{"$f":"+VLOOKUP(A7,Ruta!$K$38:$K$98,1,0)","v":{"$error":"#N/A"}},null,null,4453658,{"$error":"#N/A"}]
[4653824,null,20,null,null,20,{"$f":"+VLOOKUP(A8,Ruta!$K$38:$K$98,1,0)","v":{"$error":"#N/A"}},null,null,4653824,{"$error":"#N/A"}]
[6334121,null,20,null,null,20,{"$f":"+VLOOKUP(A9,Ruta!$K$38:$K$98,1,0)","v":{"$error":"#N/A"}},null,null,6334121,{"$error":"#N/A"}]
[9850773,null,2,null,null,2,{"$f":"+VLOOKUP(A10,Ruta!$K$38:$K$98,1,0)","v":9850773},null,null,9850773,9850773]
{"$rows_left_out":80}
{"sheet":"Encuesta","index":4,"n_rows":85,"n_cols":11,"rows_kept":85,"hidden":true}
["ENCUESTA_ID","ASESOR_ID","CODIGO_CLIENTE","FECHA_INICIO","Fecha","Semana","DE 30.000 A 50.000","DE 50.001 A 100.000","DE 100.001 A 300.000","DE 300.001 EN ADELANTE","Total"]
["A126-39","DBL55",31971928,"2020/05/02  1:10PM",{"$f":"+MID(D2,1,11)","v":"2020/05/02 "},1,{"$nulls":3},20,{"$f":"+SUM(G2:J2)","v":20}]
["A125-51","DBL51",29655305,"2020/04/29  8:30AM","2020/04/29 ",1,2,{"$nulls":3},{"$f":"+SUM(G3:J3)","v":2}]
["A125-76","DBL51",1143848323,"2020/04/29 12:13PM","2020/04/29 ",1,2,{"$nulls":3},2]
["A125-4","DBL51",10517213,"2020/04/28  8:20AM","2020/04/28 ",1,2,{"$nulls":3},2]
["A118-251","DBL53",3494086,"2020/04/28  8:26AM","2020/04/28 ",1,2,{"$nulls":3},2]
["A116-244","DBL56",67026466,"2020/04/28  8:51AM","2020/04/28 ",1,2,{"$nulls":3},2]
["A116-245","DBL56",14981868,"2020/04/28  8:52AM","2020/04/28 ",1,2,{"$nulls":3},2]
["A118-254","DBL53",24720136,"2020/04/28  9:04AM","2020/04/28 ",1,2,{"$nulls":3},2]
["A116-246","DBL56",31905517,"2020/04/28  9:24AM","2020/04/28 ",1,2,{"$nulls":3},2]
{"$rows_left_out":75}